Reaction Details
TargetBeta-secretase 1
LigandBDBM291141
Substrate/Competitorn/a
Meas. Tech.HTRF FRET Assay
pH5±n/a
Ki 55.0±n/a nM
Commentsextracted
Citation Cumming, JNScott, Jr., JDStamford, AWIserloh, UNeelamkavil, SFShao, PPWilson, JE C6-spiro iminothiadiazine dioxides as BACE inhibitors, compositions, and their use US Patent US9580396 Publication Date 2/28/2017
 
Beta-secretase 1
Name:Beta-secretase 1
Type:Protein
Mol. Mass.:55755.10
Organism:Homo sapiens (Human)
Description:P56817
Residue:501
BDBM291141
NameBDBM291141
Synonyms:US9580396, Example 5d
TypeSmall organic molecule
Emp. Form.C20H20F3N5O4S
Mol. Mass.483.464
SMILESCN1C(=N)N[C@@]2(CCCc3ccc(NC(=O)c4ccc(OC(F)(F)F)cn4)cc23)CS1(=O)=O