Reaction Details
TargetHistone-lysine N-methyltransferase KMT5B
LigandBDBM223980
Substrate/Competitorn/a
Meas. Tech.Scintillation Proximity Assay (SPA)
pH8±0
Temperature298.15±0 K
IC50 5.9e+2±n/a nM
Citation Bromberg, KDMitchell, TRUpadhyay, AKJakob, CGJhala, MAComess, KMLasko, LMLi, CTuzon, CTDai, YLi, FEram, MSNuber, ASoni, NBManaves, VAlgire, MASweis, RFTorrent, MSchotta, GSun, CMichaelides, MRShoemaker, ARArrowsmith, CHBrown, PJSanthakumar, VMartin, ARice, JCChiang, GGVedadi, MBarsyte-Lovejoy, DPappano, WN The SUV4-20 inhibitor A-196 verifies a role for epigenetics in genomic integrity. Nat Chem Biol13:317-324 (2017) 
 
Histone-lysine N-methyltransferase KMT5B
Name:Histone-lysine N-methyltransferase KMT5B
Type:Enzyme
Mol. Mass.:99219.53
Organism:Homo sapiens (Human)
Description:Q4FZB7
Residue:885
BDBM223980
NameBDBM223980
Synonyms:6,7-Dichloro-N-cyclopentylquinolin-4-amine (2)
TypeSmall organic molecule
Emp. Form.C14H14Cl2N2
Mol. Mass.281.18
SMILESClc1cc2nccc(NC3CCCC3)c2cc1Cl