Reaction Details
TargetHistone-lysine N-methyltransferase KMT5C
LigandBDBM223979
Substrate/Competitorn/a
Meas. Tech.Scintillation Proximity Assay (SPA)
pH8±0
Temperature298.15±0 K
IC50 4.8e+3±n/a nM
Citation Bromberg, KDMitchell, TRUpadhyay, AKJakob, CGJhala, MAComess, KMLasko, LMLi, CTuzon, CTDai, YLi, FEram, MSNuber, ASoni, NBManaves, VAlgire, MASweis, RFTorrent, MSchotta, GSun, CMichaelides, MRShoemaker, ARArrowsmith, CHBrown, PJSanthakumar, VMartin, ARice, JCChiang, GGVedadi, MBarsyte-Lovejoy, DPappano, WN The SUV4-20 inhibitor A-196 verifies a role for epigenetics in genomic integrity. Nat Chem Biol13:317-324 (2017) 
 
Histone-lysine N-methyltransferase KMT5C
Name:Histone-lysine N-methyltransferase KMT5C
Type:Enzyme
Mol. Mass.:52147.69
Organism:Homo sapiens (Human)
Description:Q86Y97
Residue:462
BDBM223979
NameBDBM223979
Synonyms:7-Chloro-N-cyclopentylquinolin-4-amine (1)
TypeSmall organic molecule
Emp. Form.C14H15ClN2
Mol. Mass.246.735
SMILESClc1ccc2c(NC3CCCC3)ccnc2c1