Reaction Details
TargetHistone-lysine N-methyltransferase EZH2/Polycomb protein EED [40-441]/Polycomb protein SUZ12 [559-739]
LigandBDBM225230
Substrate/Competitorn/a
Meas. Tech.Isothermal Titration Calorimetry (ITC)
pH8±0
Temperature1663.9±0 K
Kd 114±0.0 nM
Citation Qi, WZhao, KGu, JHuang, YWang, YZhang, HZhang, MZhang, JYu, ZLi, LTeng, LChuai, SZhang, CZhao, MChan, HChen, ZFang, DFei, QFeng, LFeng, LGao, YGe, HGe, XLi, GLingel, ALin, YLiu, YLuo, FShi, MWang, LWang, ZYu, YZeng, JZeng, CZhang, LZhang, QZhou, SOyang, CAtadja, PLi, E An allosteric PRC2 inhibitor targeting the H3K27me3 binding pocket of EED. Nat Chem Biol13:381-388 (2017) 
 
Histone-lysine N-methyltransferase EZH2/Polycomb protein EED [40-441]/Polycomb protein SUZ12 [559-739]
Name:Histone-lysine N-methyltransferase EZH2/Polycomb protein EED [40-441]/Polycomb protein SUZ12 [559-739]
Synonyms:Polycomb repressive complex 2 (PRC2)
Type:Protein
Mol. Mass.:n/a
Description:Human three-member PRC2 complex (EZH2(1-751 aa)/EED(40-441 aa)/SUZ12(559-739 aa))
Components:This complex has 3 components.
Component 1
Name:Histone-lysine N-methyltransferase EZH2
Synonyms:Enhancer of zeste homolog 2 (EZH2)
Type:Protein
Mol. Mass.:86024.60
Organism:Homo sapiens (Human)
Description:Q15910-2
Residue:751
Component 2
Name:Polycomb protein EED [40-441]
Type:Protein
Mol. Mass.:46101.42
Organism:Homo sapiens (Human)
Description:Human polycomb protein EED (40-441 aa)
Residue:402
Component 3
Name:Polycomb protein SUZ12 [559-739]
Synonyms:CHET9 KIAA0160 SUZ12 | SUZ12_HUMAN
Type:Protein
Mol. Mass.:20870.88
Organism:Homo sapiens (Human)
Description:Human polycomb protein SUZ12 (559-739 aa)
Residue:181
BDBM225230
NameBDBM225230
Synonyms:EED226 | US11013745, Compound EED226
TypeSmall organic molecule
Emp. Form.C17H15N5O3S
Mol. Mass.369.398
SMILESCS(=O)(=O)c1ccc(cc1)-c1cnc(NCc2ccco2)n2cnnc12