Reaction Details
TargetGalectin-7
LigandBDBM223990
Substrate/Competitorn/a
Meas. Tech.Fluorescence Polarization Assay
Temperature298.15±0 K
Kd 1.29e+5± 1.8e+4 nM
Citation Dion, JDeshayes, FStorozhylova, NAdvedissian, TLambert, AViguier, MTellier, CDussouy, CPoirier, FGrandjean, C Lactosamine-Based Derivatives as Tools to Delineate the Biological Functions of Galectins: Application to Skin Tissue Repair. Chembiochem18:782-789 (2017) 
 
Galectin-7
Name:Galectin-7
Type:Galactoside-binding protein
Mol. Mass.:15077.89
Organism:Homo sapiens (Human)
Description:n/a
Residue:136
BDBM223990
NameBDBM223990
Synonyms:2-[6-Maleimide)caproyl]ethyl [3-O-(2-naphthyl)methyl-β-D-galactopyranosyl]-(1-4)-2-deoxy-2-(3-methoxybenzamido)-β-D-glucopyranoside (13)
TypeSmall organic molecule
Emp. Form.C43H53N3O15
Mol. Mass.851.892
SMILESCOc1cccc(c1)C(=O)NC1C(O)[C@H](O[C@@H]2OC(CO)[C@H](O)C(OCc3ccc4ccccc4c3)C2O)C(CO)O[C@H]1OCCNC(=O)CCCCCN1C(=O)C=CC1=O