Reaction Details
TargetGalectin-7
LigandBDBM223992
Substrate/Competitorn/a
Meas. Tech.Fluorescence Polarization Assay
Temperature277.15±0 K
Kd 8.6e+4± 3.1e+4 nM
Citation Dion, JDeshayes, FStorozhylova, NAdvedissian, TLambert, AViguier, MTellier, CDussouy, CPoirier, FGrandjean, C Lactosamine-Based Derivatives as Tools to Delineate the Biological Functions of Galectins: Application to Skin Tissue Repair. Chembiochem18:782-789 (2017) 
 
Galectin-7
Name:Galectin-7
Type:Galactoside-binding protein
Mol. Mass.:15077.89
Organism:Homo sapiens (Human)
Description:n/a
Residue:136
BDBM223992
NameBDBM223992
Synonyms:4-O-[3-O-(3-methoxybenzyl)-β-D-galactopyranosyl)]-1-azido-1,2-dideoxy-2-(3-methoxybenzamido)-β-D-glucopyranose (1)
TypeSmall organic molecule
Emp. Form.C28H36N4O12
Mol. Mass.620.605
SMILESCOc1cccc(COC2[C@@H](O)C(CO)O[C@@H](O[C@@H]3C(CO)O[C@@H](N=[N+]=[N-])C(NC(=O)c4cccc(OC)c4)C3O)C2O)c1