Reaction Details
TargetGalectin-7
LigandBDBM223993
Substrate/Competitorn/a
Meas. Tech.Fluorescence Polarization Assay
Temperature277.15±0 K
Kd 3.2e+4± 1.7e+4 nM
Citation Dion, JDeshayes, FStorozhylova, NAdvedissian, TLambert, AViguier, MTellier, CDussouy, CPoirier, FGrandjean, C Lactosamine-Based Derivatives as Tools to Delineate the Biological Functions of Galectins: Application to Skin Tissue Repair. Chembiochem18:782-789 (2017) 
 
Galectin-7
Name:Galectin-7
Type:Galactoside-binding protein
Mol. Mass.:15077.89
Organism:Homo sapiens (Human)
Description:n/a
Residue:136
BDBM223993
NameBDBM223993
Synonyms:TD139
TypeSmall organic molecule
Emp. Form.C28H30F2N6O8S
Mol. Mass.648.635
SMILESOCC1O[C@@H](S[C@@H]2OC(CO)[C@H](O)C(C2O)n2cc(nn2)-c2cccc(F)c2)C(O)C([C@H]1O)n1cc(nn1)-c1cccc(F)c1