Reaction Details
TargetSerine/threonine-protein kinase haspin [470-798]
LigandBDBM224009
Substrate/Competitorn/a
Meas. Tech.Equilibrium Binding/Displacement Assay with Fluorescence Anisotropy
pH7.5±n/a
Kd 0.50±0.06 nM
Commentsextracted
Citation Kestav, KViht, KKonovalov, AEnkvist, EUri, ALavogina, D Slowly on, Slowly off: Bisubstrate-Analogue Conjugates of 5-Iodotubercidin and Histone H3 Peptide Targeting Protein Kinase Haspin. Chembiochem18:790-798 (2017) 
 
Serine/threonine-protein kinase haspin [470-798]
Name:Serine/threonine-protein kinase haspin [470-798]
Type:Enzyme
Mol. Mass.:37470.17
Organism:Homo sapiens (Human)
Description:Human haspin (470-798 aa)
Residue:329
BDBM224009
NameBDBM224009
Synonyms:ARC-3430
TypeSmall organic molecule
Emp. Form.C85H124IN26O22
Mol. Mass.1988.9579
SMILESC[C@H]([NH3+])C(=O)N[C@@H](CCCNC(N)=[NH2+])C(=O)N[C@@H](CCCCNC(=O)C[C@@H](NC(=O)CCCCCNC(=O)[C@H]1O[C@H]([C@H](O)[C@@H]1O)n1cc(I)c2c(N)ncnc12)C([O-])=O)C(=O)N[C@@H](CCCNC(N)=[NH2+])C(=O)N[C@@H](CCC(N)=O)C(=O)N[C@@H](C(C)O)C(=O)N[C@@H](C)C(=O)N[C@H](CCCCNC(=O)c1ccc(c(c1)C(O)=O)-c1c2ccc(cc2oc2cc(ccc12)=[N+](C)C)N(C)C)C(N)=O