Reaction Details
TargetSerine/threonine-protein kinase haspin [470-798]
LigandBDBM224010
Substrate/Competitorn/a
Meas. Tech.Kinetic Assay with Fluorescence Anisotropy
pH7.5±n/a
Kd 2.84±0.0 nM
Commentsextracted
Citation Kestav, KViht, KKonovalov, AEnkvist, EUri, ALavogina, D Slowly on, Slowly off: Bisubstrate-Analogue Conjugates of 5-Iodotubercidin and Histone H3 Peptide Targeting Protein Kinase Haspin. Chembiochem18:790-798 (2017) 
 
Serine/threonine-protein kinase haspin [470-798]
Name:Serine/threonine-protein kinase haspin [470-798]
Type:Enzyme
Mol. Mass.:37470.17
Organism:Homo sapiens (Human)
Description:Human haspin (470-798 aa)
Residue:329
BDBM224010
NameBDBM224010
Synonyms:ARC-3384
TypeSmall organic molecule
Emp. Form.C85H125N26O22
Mol. Mass.1863.0614
SMILESCC(O)[C@H](NC(=O)[C@H](CCC(N)=O)NC(=O)[C@H](CCCNC(N)=[NH2+])NC(=O)[C@H](CCCCNC(=O)C[C@@H](NC(=O)CCCCCNC(=O)[C@H]1O[C@H]([C@H](O)[C@@H]1O)n1ccc2c(N)ncnc12)C([O-])=O)NC(=O)[C@H](CCCNC(N)=[NH2+])NC(=O)[C@H](C)[NH3+])C(=O)N[C@@H](C)C(=O)N[C@H](CCCCNC(=O)c1ccc(c(c1)C(O)=O)-c1c2ccc(cc2oc2cc(ccc12)=[N+](C)C)N(C)C)C(N)=O