Reaction Details
TargetMas-related G-protein coupled receptor member X2
LigandBDBM85324
Substrate/Competitorn/a
Meas. Tech.Intracellular Calcium Mobilization Assay
pH7.4±0
Temperature303.15±0 K
EC50 4.2e+2±1.3e+2 nM
Citation Lansu, KKarpiak, JLiu, JHuang, XPMcCorvy, JDKroeze, WKChe, TNagase, HCarroll, FIJin, JShoichet, BKRoth, BL In silico design of novel probes for the atypical opioid receptor MRGPRX2. Nat Chem Biol13:529-536 (2017) 
 
Mas-related G-protein coupled receptor member X2
Name:Mas-related G-protein coupled receptor member X2
Type:GPCR
Mol. Mass.:37104.79
Organism:Homo sapiens (Human)
Description:Q96LB1
Residue:330
BDBM85324
NameBDBM85324
Synonyms:CAS_186901-48-4 cortistatin14
TypeSmall organic molecule
Emp. Form.C81H113N19O19S2
Mol. Mass.1721.01
SMILESC[C@@H](O)[C@@H]1NC(=O)[C@H](CCCCN)NC(=O)[C@H](Cc2c[nH]c3ccccc23)NC(=O)[C@H](Cc2ccccc2)NC(=O)[C@H](Cc2ccccc2)NC(=O)[C@H](CC(N)=O)NC(=O)[C@H](CCCCN)NC(=O)[C@H](CSSC[C@H](NC(=O)[C@H](CO)NC(=O)[C@H](CO)NC(=O)[C@H](Cc2ccccc2)NC1=O)C(=O)N[C@@H](CCCCN)C(O)=O)NC(=O)[C@@H]1CCCN1