Reaction Details
TargetMas-related G-protein coupled receptor member X2
LigandBDBM50290872
Substrate/Competitorn/a
Meas. Tech.Intracellular Calcium Mobilization Assay
pH7.4±0
Temperature303.15±0 K
EC50 6.5e+2±9e+1 nM
Citation Lansu, KKarpiak, JLiu, JHuang, XPMcCorvy, JDKroeze, WKChe, TNagase, HCarroll, FIJin, JShoichet, BKRoth, BL In silico design of novel probes for the atypical opioid receptor MRGPRX2. Nat Chem Biol13:529-536 (2017) 
 
Mas-related G-protein coupled receptor member X2
Name:Mas-related G-protein coupled receptor member X2
Type:GPCR
Mol. Mass.:37104.79
Organism:Homo sapiens (Human)
Description:Q96LB1
Residue:330
BDBM50290872
NameBDBM50290872
Synonyms:(-)-rel-3-((4aR,12aS)-2-methyl-1,2,3,4,4a,5,12,12a-octahydropyrido[3,4-b]acridin-4a-yl)phenol CHEMBL327745 TAN-67 | Tan-67 (racemic)
TypeSmall organic molecule
Emp. Form.C23H24N2O
Mol. Mass.344.4495
SMILESCN1CC[C@@]2(Cc3nc4ccccc4cc3C[C@H]2C1)c1cccc(O)c1