Reaction Details
TargetMas-related G-protein coupled receptor member X2
LigandBDBM224033
Substrate/Competitorn/a
Meas. Tech.Intracellular Calcium Mobilization Assay
pH7.4±0
Temperature303.15±0 K
EC50 1.5e+4±7.6e+3 nM
Citation Lansu, KKarpiak, JLiu, JHuang, XPMcCorvy, JDKroeze, WKChe, TNagase, HCarroll, FIJin, JShoichet, BKRoth, BL In silico design of novel probes for the atypical opioid receptor MRGPRX2. Nat Chem Biol13:529-536 (2017) 
 
Mas-related G-protein coupled receptor member X2
Name:Mas-related G-protein coupled receptor member X2
Type:GPCR
Mol. Mass.:37104.79
Organism:Homo sapiens (Human)
Description:Q96LB1
Residue:330
BDBM224033
NameBDBM224033
Synonyms:Dynorphin A (1-9) | YGGFLRRXR
TypeSmall organic molecule
Emp. Form.C53H86N18O11
Mol. Mass.1151.3639
SMILESCC[C@H](C)[C@H](NC(=O)[C@H](CCCNC(N)=N)NC(=O)[C@H](CCCNC(N)=N)NC(=O)[C@H](CC(C)C)NC(=O)[C@H](Cc1ccccc1)NC(=O)CNC(=O)[C@@H](C)NC(=O)[C@@H](N)Cc1ccc(O)cc1)C(=O)N[C@@H](CCCNC(N)=N)C(O)=O