Reaction Details
TargetMas-related G-protein coupled receptor member X2
LigandBDBM50037481
Substrate/Competitorn/a
Meas. Tech.PRESTO-Tango Assay
pH7.4±0
Temperature303.15±0 K
EC50 5.0e+4±2.4e+4 nM
Citation Lansu, KKarpiak, JLiu, JHuang, XPMcCorvy, JDKroeze, WKChe, TNagase, HCarroll, FIJin, JShoichet, BKRoth, BL In silico design of novel probes for the atypical opioid receptor MRGPRX2. Nat Chem Biol13:529-536 (2017) 
 
Mas-related G-protein coupled receptor member X2
Name:Mas-related G-protein coupled receptor member X2
Type:GPCR
Mol. Mass.:37104.79
Organism:Homo sapiens (Human)
Description:Q96LB1
Residue:330
BDBM50037481
NameBDBM50037481
Synonyms:(-)-cis-Normetazocine CHEMBL326370
TypeSmall organic molecule
Emp. Form.C14H19NO
Mol. Mass.217.3068
SMILESC[C@@H]1C2Cc3ccc(O)cc3[C@]1(C)CCN2