Reaction Details
TargetMas-related G-protein coupled receptor member X2
LigandBDBM224016
Substrate/Competitorn/a
Meas. Tech.PRESTO-Tango Assay
pH7.4±0
Temperature303.15±0 K
EC50 7.2e+3±3.0e+3 nM
Citation Lansu, KKarpiak, JLiu, JHuang, XPMcCorvy, JDKroeze, WKChe, TNagase, HCarroll, FIJin, JShoichet, BKRoth, BL In silico design of novel probes for the atypical opioid receptor MRGPRX2. Nat Chem Biol13:529-536 (2017) 
 
Mas-related G-protein coupled receptor member X2
Name:Mas-related G-protein coupled receptor member X2
Type:GPCR
Mol. Mass.:37104.79
Organism:Homo sapiens (Human)
Description:Q96LB1
Residue:330
BDBM224016
NameBDBM224016
Synonyms:(+)-Metazocine
TypeSmall organic molecule
Emp. Form.C15H21NO
Mol. Mass.231.3333
SMILESC[C@@H]1[C@@H]2Cc3ccc(O)cc3[C@@]1(C)CCN2C