Reaction Details
TargetMas-related G-protein coupled receptor member X2
LigandBDBM224026
Substrate/Competitorn/a
Meas. Tech.PRESTO-Tango Assay
pH7.4±0
Temperature303.15±0 K
EC50 3.3e+4±7.6e+3 nM
Citation Lansu, KKarpiak, JLiu, JHuang, XPMcCorvy, JDKroeze, WKChe, TNagase, HCarroll, FIJin, JShoichet, BKRoth, BL In silico design of novel probes for the atypical opioid receptor MRGPRX2. Nat Chem Biol13:529-536 (2017) 
 
Mas-related G-protein coupled receptor member X2
Name:Mas-related G-protein coupled receptor member X2
Type:GPCR
Mol. Mass.:37104.79
Organism:Homo sapiens (Human)
Description:Q96LB1
Residue:330
BDBM224026
NameBDBM224026
Synonyms:Dynorphin B (1-13) | YGGFLRRQFKVVT
TypeSmall organic molecule
Emp. Form.C74H115N21O17
Mol. Mass.1570.8354
SMILESCC(C)C[C@H](NC(=O)[C@H](Cc1ccccc1)NC(=O)CNC(=O)CNC(=O)[C@@H](N)Cc1ccc(O)cc1)C(=O)N[C@@H](CCCNC(N)=N)C(=O)N[C@@H](CCCNC(N)=N)C(=O)N[C@@H](CCC(N)=O)C(=O)N[C@@H](Cc1ccccc1)C(=O)N[C@@H](CCCCN)C(=O)N[C@@H](C(C)C)C(=O)N[C@@H](C(C)C)C(=O)N[C@@H]([C@H](C)O)C(O)=O