Reaction Details
TargetSerine/threonine-protein kinase pim-1
LigandBDBM225033
Substrate/Competitorn/a
Meas. Tech.Enzyme Assay
IC50 1.2±n/a nM
Citation Wang, HCee, VJHerberich, BJJackson, CLLanman, BANixey, TPettus, LHReed, ABWu, BWurz, RTasker, A Azole compounds as PIM inhibitors US Patent US9321756 Publication Date 4/26/2016
 
Serine/threonine-protein kinase pim-1
Name:Serine/threonine-protein kinase pim-1
Type:Protein
Mol. Mass.:35681.82
Organism:Homo sapiens (Human)
Description:P11309
Residue:313
BDBM225033
NameBDBM225033
Synonyms:US9321756, 300
TypeSmall organic molecule
Emp. Form.C20H20N6O2
Mol. Mass.376.4118
SMILESCC(C)Nc1nnc(o1)-c1ccc2[nH]cc(-c3cc(=O)[nH]c(n3)C3CC3)c2c1