Reaction Details
TargetSerine/threonine-protein kinase pim-2
LigandBDBM225078
Substrate/Competitorn/a
Meas. Tech.Enzyme Assay
IC50 1.156±n/a nM
Citation Wang, HCee, VJHerberich, BJJackson, CLLanman, BANixey, TPettus, LHReed, ABWu, BWurz, RTasker, A Azole compounds as PIM inhibitors US Patent US9321756 Publication Date 4/26/2016
 
Serine/threonine-protein kinase pim-2
Name:Serine/threonine-protein kinase pim-2
Type:Serine/threonine-protein kinase
Mol. Mass.:34185.93
Organism:Homo sapiens (Human)
Description:Q9P1W9
Residue:311
BDBM225078
NameBDBM225078
Synonyms:US9321756, 47
TypeSmall organic molecule
Emp. Form.C21H20N6O3
Mol. Mass.404.4219
SMILESCC(C)Nc1nnc(o1)-c1ccc2[nH]cc(-c3nc(cc(n3)C(O)=O)C3CC3)c2c1