Reaction Details
TargetSerine/threonine-protein kinase pim-3
LigandBDBM224903
Substrate/Competitorn/a
Meas. Tech.Enzyme Assay
IC50 0.425±n/a nM
Citation Wang, HCee, VJHerberich, BJJackson, CLLanman, BANixey, TPettus, LHReed, ABWu, BWurz, RTasker, A Azole compounds as PIM inhibitors US Patent US9321756 Publication Date 4/26/2016
 
Serine/threonine-protein kinase pim-3
Name:Serine/threonine-protein kinase pim-3
Type:Protein
Mol. Mass.:35888.19
Organism:Homo sapiens (Human)
Description:Q86V86
Residue:326
BDBM224903
NameBDBM224903
Synonyms:US9321756, 155
TypeSmall organic molecule
Emp. Form.C19H15N7S
Mol. Mass.373.434
SMILESCc1cn(cn1)-c1cccc(n1)-c1c[nH]c2ccc(cc12)-c1nnc(N)s1