Reaction Details
TargetRibosomal protein S6 kinase beta-1
LigandBDBM224460
Substrate/Competitorn/a
Meas. Tech.Enzyme Assay
pH7.5±n/a
IC50 2.5±n/a nM
Commentsextracted
Citation Lan, RHuck, BRChen, XDeselm, LCQiu, HXiao, YNeagu, CMochalkin, IJohnson, TL Aminopyrimidine derivatives for use as modulators of kinase activity US Patent US9321760 Publication Date 4/26/2016
 
Ribosomal protein S6 kinase beta-1
Name:Ribosomal protein S6 kinase beta-1
Type:Enzyme
Mol. Mass.:59139.89
Organism:Homo sapiens (Human)
Description:His-tagged S6K1.
Residue:525
BDBM224460
NameBDBM224460
Synonyms:US10080750, Compound 138 US9662330, Compound 138
TypeSmall organic molecule
Emp. Form.C22H22ClFN4O
Mol. Mass.412.888
SMILESNc1ncnc(N2CCC(CC2)C(O)c2ccc(Cl)cc2)c1-c1ccc(F)cc1