Reaction Details
TargetIsoform 1 of Metabotropic glutamate receptor 5 (5a)
LigandBDBM224627
Substrate/Competitorn/a
Meas. Tech.MPEP Binding Assay
pH7.4±n/a
Ki 15±n/a nM
Commentsextracted
Citation Jaeschke, GLindemann, LRicci, ARueher, DStadler, HVieira, E Ethynyl derivatives US Patent US9328070 Publication Date 5/3/2016
 
Isoform 1 of Metabotropic glutamate receptor 5 (5a)
Name:Isoform 1 of Metabotropic glutamate receptor 5 (5a)
Type:Enzyme
Mol. Mass.:128885.13
Organism:Homo sapiens (Human)
Description:P41594-2
Residue:1180
BDBM224627
NameBDBM224627
Synonyms:US9328070, 2
TypeSmall organic molecule
Emp. Form.C19H19ClN2O
Mol. Mass.326.82
SMILESCN(C(=O)c1ccc(cn1)C#Cc1cccc(Cl)c1)C(C)(C)C