Reaction Details
TargetIsoform PDE9A2 of High affinity cGMP-specific 3',5'-cyclic phosphodiesterase 9A (PDE9A2)
LigandBDBM224796
Substrate/Competitorn/a
Meas. Tech.Scintillation Proximity Assay
Temperature298.15±n/a K
IC50 32±n/a nM
Commentsextracted
Citation Heine, NEickmeier, CFerrera, MGiovannini, RRosenbrock, HSchaenzle, G 6-cycloalkyl-pyrazolopyrimidinones for the treatment of CNS disorders US Patent US9328120 Publication Date 5/3/2016
 
Isoform PDE9A2 of High affinity cGMP-specific 3',5'-cyclic phosphodiesterase 9A (PDE9A2)
Name:Isoform PDE9A2 of High affinity cGMP-specific 3',5'-cyclic phosphodiesterase 9A (PDE9A2)
Type:Protein
Mol. Mass.:61702.98
Organism:Homo sapiens (Human)
Description:O76083-2
Residue:533
BDBM224796
NameBDBM224796
Synonyms:US9328120, 26
TypeSmall organic molecule
Emp. Form.C19H17N7O
Mol. Mass.359.3846
SMILESCc1ccncc1-n1ncc2c1nc([nH]c2=O)[C@@H]1CC[C@H]1c1ncccn1