Reaction Details
TargetC-C chemokine receptor type 6
LigandBDBM291181
Substrate/Competitorn/a
Meas. Tech.In Vitro Affinity Assay
IC50 1.60±n/a nM
Citation Musicki, BAubert, JBoiteau, JClary, LRossio, PSchuppli-Nollet, M Disubstituted 3,4-diamino-3-cyclobutene-1,2-dione compounds for use in the treatment of chemokine-mediated diseases US Patent US9580412 Publication Date 2/28/2017
 
C-C chemokine receptor type 6
Name:C-C chemokine receptor type 6
Type:Enzyme
Mol. Mass.:42510.84
Organism:Homo sapiens (Human)
Description:P51684
Residue:374
BDBM291181
NameBDBM291181
Synonyms:6-chloro-2-hydroxy-N,N-dimethyl-3-(2-{[(5-methylfuran-2-yl)-(tetrahydrothiophen-2-yl)methyl]amino}-3,4-dioxocyclobut-1-enylamino)benzenesulfonamide | US9580412, Example 10
TypeSmall organic molecule
Emp. Form.C23H27N3O5S2
Mol. Mass.489.608
SMILESCN(C)S(=O)(=O)c1cccc(Nc2c(NC(C3CCCS3)c3ccc(C)o3)c(=O)c2=O)c1C