Reaction Details
TargetPancreatic triacylglycerol lipase
LigandBDBM224806
Substrate/Competitorn/a
Meas. Tech.Inhibition Assay
pH6.8±n/a
IC50 6.3e+3± 3e+2 nM
Commentsextracted
Citation Chung, BYKim, THLee, SSBai, HLee, SPark, CH Rotenone derivatives and a use thereof US Patent US9328123 Publication Date 5/3/2016
 
Pancreatic triacylglycerol lipase
Name:Pancreatic triacylglycerol lipase
Type:Enzyme
Mol. Mass.:50080.69
Organism:Sus scrofa (Pig)
Description:P00591
Residue:450
BDBM224806
NameBDBM224806
Synonyms:US9328123, Rotenone A
TypeSmall organic molecule
Emp. Form.C24H24O6
Mol. Mass.408.4438
SMILESCOc1cc2OCC3Oc4c5C[C@@H](Oc5ccc4[C@]4(CO4)C3c2cc1OC)C(C)=C