Reaction Details
TargetDual specificity protein phosphatase 5 [180-384]
LigandBDBM50336799
Substrate/Competitorp-Nitrophenol (p-NPP)
Meas. Tech.p-NPP Assay
Temperature298.15±n/a K
Ki 25±5 nM
IC50 4.4e+4± 6e+3 nM
Commentsextracted
Citation Neumann, TSSpan, EAKalous, KSBongard, RGastonguay, ALepley, MAKutty, RGNayak, JBohl, CLange, RGSarker, MITalipov, MRRathore, RRamchandran, RSem, DS Identification of inhibitors that target dual-specificity phosphatase 5 provide new insights into the binding requirements for the two phosphate pockets. BMC Biochem16:19 (2015) 
 
Dual specificity protein phosphatase 5 [180-384]
Name:Dual specificity protein phosphatase 5 [180-384]
Type:Protein
Mol. Mass.:22525.06
Organism:Homo sapiens (Human)
Description:Human DUSP5 C-terminal phosphatase domain (180-384 aa)
Residue:205
BDBM50336799
p-Nitrophenol (p-NPP)
NameBDBM50336799
Synonyms:5,5',5''-[1,3,6-naphthalenetriyltris(sulfonylimino)]tris[1,3-benzenesulfonate analogue 8,8'-[CARBONYLBIS[IMINO-3,1-PHENYLENECARBONYLIMINO(4-METHYL-3,1-PHENYLENE)CARBONYLIMINO]]BIS-1,3,5-NAPHTHALENETRISULFONIC ACID 8-[(4-methyl-3-{[3-({[3-({2-methyl-5-[(4,6,8-trisulfonaphthalen-1-yl)carbamoyl]phenyl}carbamoyl)phenyl]carbamoyl}amino)benzene]amido}benzene)amido]naphthalene-1,3,5-trisulfonic acid Germanin US8835659, Suramin suramin
TypeSmall organic molecule
Emp. Form.C51H40N6O23S6
Mol. Mass.1297.28
SMILESCc1ccc(cc1NC(=O)c1cccc(NC(=O)Nc2cccc(c2)C(=O)Nc2cc(ccc2C)C(=O)Nc2ccc(c3cc(cc(c23)S(O)(=O)=O)S(O)(=O)=O)S(O)(=O)=O)c1)C(=O)Nc1ccc(c2cc(cc(c12)S(O)(=O)=O)S(O)(=O)=O)S(O)(=O)=O