Reaction Details
TargetAlpha-glucosidase MAL32
LigandBDBM225285
Substrate/Competitorn/a
Meas. Tech.In Vitro α-Glucosidase Inhibitory Assay
pH6.8±0
Temperature310.15±0 K
IC50 9.83e+3± 1.2e+2 nM
Citation Wang, GWang, JXie, ZChen, MLi, LPeng, YChen, SLi, WDeng, B Discovery of 3,3-di(indolyl)indolin-2-one as a novel scaffold for a-glucosidase inhibitors: In silico studies and SAR predictions Bioorg Chem72:228-233 (2017)  
 
Alpha-glucosidase MAL32
Name:Alpha-glucosidase MAL32
Type:Hydrolase
Mol. Mass.:68132.36
Organism:Saccharomyces cerevisiae
Description:Purchased from Wako Fine Chemicals Co. Ltd.
Residue:584
BDBM225285
NameBDBM225285
Synonyms:1,1''-Dibenzyl-1H,1''H-[3,3':3',3''-terindol]-2'(1'H)-one (4f)
TypeSmall organic molecule
Emp. Form.C38H29N3O
Mol. Mass.543.6564
SMILESO=C1Nc2ccccc2C1(c1cn(Cc2ccccc2)c2ccccc12)c1cn(Cc2ccccc2)c2ccccc12