Reaction Details
TargetAlpha-glucosidase MAL32
LigandBDBM225293
Substrate/Competitorn/a
Meas. Tech.In Vitro α-Glucosidase Inhibitory Assay
pH6.8±0
Temperature310.15±0 K
IC50 1.480e+4± 1.2e+2 nM
Citation Wang, GWang, JXie, ZChen, MLi, LPeng, YChen, SLi, WDeng, B Discovery of 3,3-di(indolyl)indolin-2-one as a novel scaffold for a-glucosidase inhibitors: In silico studies and SAR predictions Bioorg Chem72:228-233 (2017)  
 
Alpha-glucosidase MAL32
Name:Alpha-glucosidase MAL32
Type:Hydrolase
Mol. Mass.:68132.36
Organism:Saccharomyces cerevisiae
Description:Purchased from Wako Fine Chemicals Co. Ltd.
Residue:584
BDBM225293
NameBDBM225293
Synonyms:1,1''-Diisobutyl-[3,3':3',3''-terindolin]-2'-one (4n)
TypeSmall organic molecule
Emp. Form.C32H33N3O
Mol. Mass.475.6239
SMILESCC(C)Cn1cc(c2ccccc12)C1(C(=O)Nc2ccccc12)c1cn(CC(C)C)c2ccccc12