Reaction Details
TargetCyclin-dependent kinase 2
LigandBDBM8046
Substrate/Competitorn/a
Meas. Tech.OctetRed_Method1
Kd 1430±638 nM
Citation D3R, DD CSAR CDK2 Kinase D3R D3R Publication Date 6/30/2015
 
Cyclin-dependent kinase 2
Name:Cyclin-dependent kinase 2
Type:Enzyme Subunit
Mol. Mass.:33938.17
Organism:Homo sapiens (Human)
Description:P24941
Residue:298
BDBM8046
NameBDBM8046
Synonyms:(4-Fluorophenyl)-[4-(2,4-dimethylthiazol-5-yl)pyrimidin-2-yl]amine 4-(2,4-dimethyl-1,3-thiazol-5-yl)-N-(4-fluorophenyl)pyrimidin-2-amine | CS14
TypeSmall organic molecule
Emp. Form.C15H13FN4S
Mol. Mass.300.354
SMILESCc1nc(C)c(s1)-c1ccnc(Nc2ccc(F)cc2)n1