Reaction Details
TargetSerine/threonine-protein kinase Chk1 [2-280]
LigandBDBM225333
Substrate/Competitorn/a
Meas. Tech.33P-Radiometric_Method1
Ki 178±n/a nM
Citation D3R, DD Abbott CHK1 Kinase D3R D3R Publication Date 6/30/2015
 
Serine/threonine-protein kinase Chk1 [2-280]
Name:Serine/threonine-protein kinase Chk1 [2-280]
Type:n/a
Mol. Mass.:32109.16
Organism:Homo sapiens (Human)
Description:O14757[2-280]
Residue:279
BDBM225333
NameBDBM225333
Synonyms:Chk1_4
TypeSmall Organic Molecule
Emp. Form.C18H16N2O3
Mol. Mass.308.3312
SMILESCOc1cc2Cc3c(n[nH]c3-c3ccc(O)cc3)-c2cc1OC