Reaction Details
TargetSerine/threonine-protein kinase Chk1 [2-280]
LigandBDBM91938
Substrate/Competitorn/a
Meas. Tech.33P-Radiometric_Method1
Ki 15.4±n/a nM
Citation D3R, DD Abbott CHK1 Kinase D3R D3R Publication Date 6/30/2015
 
Serine/threonine-protein kinase Chk1 [2-280]
Name:Serine/threonine-protein kinase Chk1 [2-280]
Type:n/a
Mol. Mass.:32109.16
Organism:Homo sapiens (Human)
Description:O14757[2-280]
Residue:279
BDBM91938
NameBDBM91938
Synonyms:Chk1_7
Typen/a
Emp. Form.C14H13ClN4O3
Mol. Mass.320.731
SMILESCOc1ccc(Cl)cc1NC(=O)Nc1ccc(cn1)C(N)=O