Reaction Details
TargetSerine/threonine-protein kinase Chk1 [2-280]
LigandBDBM91904
Substrate/Competitorn/a
Meas. Tech.33P-Radiometric_Method1
Ki 11.5±n/a nM
Citation D3R, DD Abbott CHK1 Kinase D3R D3R Publication Date 6/30/2015
 
Serine/threonine-protein kinase Chk1 [2-280]
Name:Serine/threonine-protein kinase Chk1 [2-280]
Type:n/a
Mol. Mass.:32109.16
Organism:Homo sapiens (Human)
Description:O14757[2-280]
Residue:279
BDBM91904
NameBDBM91904
Synonyms:Chk1_38
Typen/a
Emp. Form.C17H17BrN6O
Mol. Mass.401.26
SMILESBrc1ccc(N2CCCCC2)c(NC(=O)Nc2cnc(cn2)C#N)c1