Reaction Details
TargetSerine/threonine-protein kinase Chk1 [2-280]
LigandBDBM91957
Substrate/Competitorn/a
Meas. Tech.33P-Radiometric_Method1
Ki 40.4±n/a nM
Citation D3R, DD Abbott CHK1 Kinase D3R D3R Publication Date 6/30/2015
 
Serine/threonine-protein kinase Chk1 [2-280]
Name:Serine/threonine-protein kinase Chk1 [2-280]
Type:n/a
Mol. Mass.:32109.16
Organism:Homo sapiens (Human)
Description:O14757[2-280]
Residue:279
BDBM91957
NameBDBM91957
Synonyms:Chk1_89
Typen/a
Emp. Form.C17H11N5O3
Mol. Mass.333.3009
SMILESOC(=O)c1ccc2cc(NC(=O)Nc3cnc(cn3)C#N)ccc2c1