Reaction Details
TargetSerine/threonine-protein kinase Chk1 [2-280]
LigandBDBM225364
Substrate/Competitorn/a
Meas. Tech.33P-Radiometric_Method1
Ki 9.06±n/a nM
Citation D3R, DD Abbott CHK1 Kinase D3R D3R Publication Date 6/30/2015
 
Serine/threonine-protein kinase Chk1 [2-280]
Name:Serine/threonine-protein kinase Chk1 [2-280]
Type:n/a
Mol. Mass.:32109.16
Organism:Homo sapiens (Human)
Description:O14757[2-280]
Residue:279
BDBM225364
NameBDBM225364
Synonyms:Chk1_109
TypeSmall Organic Molecule
Emp. Form.C24H18N6O5
Mol. Mass.470.4369
SMILESCOc1cc(ccc1[N+]([O-])=O)-c1ccc2c(Nc3ccc(NC(=O)c4cc[nH]n4)cc3NC2=O)c1