Reaction Details
TargetSerine/threonine-protein kinase Chk1 [2-280]
LigandBDBM225369
Substrate/Competitorn/a
Meas. Tech.33P-Radiometric_Method1
Ki 18.7±n/a nM
Citation D3R, DD Abbott CHK1 Kinase D3R D3R Publication Date 6/30/2015
 
Serine/threonine-protein kinase Chk1 [2-280]
Name:Serine/threonine-protein kinase Chk1 [2-280]
Type:n/a
Mol. Mass.:32109.16
Organism:Homo sapiens (Human)
Description:O14757[2-280]
Residue:279
BDBM225369
NameBDBM225369
Synonyms:Chk1_118
TypeSmall Organic Molecule
Emp. Form.C30H29N3O4
Mol. Mass.495.569
SMILESCOc1cc(ccc1O)-c1ccc(cc1)-c1[nH]nc-2c1Cc1cc(ccc-21)C(=O)NC1CCC(O)CC1