Reaction Details
TargetSerine/threonine-protein kinase Chk1 [2-280]
LigandBDBM91849
Substrate/Competitorn/a
Meas. Tech.33P-Radiometric_Method1
Ki 11.5±n/a nM
Citation D3R, DD Abbott CHK1 Kinase D3R D3R Publication Date 6/30/2015
 
Serine/threonine-protein kinase Chk1 [2-280]
Name:Serine/threonine-protein kinase Chk1 [2-280]
Type:n/a
Mol. Mass.:32109.16
Organism:Homo sapiens (Human)
Description:O14757[2-280]
Residue:279
BDBM91849
NameBDBM91849
Synonyms:Chk1_125
Typen/a
Emp. Form.C21H18N4O3
Mol. Mass.374.3926
SMILESCOC(=O)Cc1ccc2Nc3cc(Nc4ccncc4)ccc3C(=O)Nc2c1