Reaction Details
TargetMitogen-activated protein kinase 1
LigandBDBM35641
Substrate/Competitorn/a
Meas. Tech.Photometric_Method2
Ki 4±n/a nM
Citation D3R, DD Vertex ERK2 D3R D3R Publication Date 6/30/2015
 
Mitogen-activated protein kinase 1
Name:Mitogen-activated protein kinase 1
Type:Ser/Thr Protein Kinase
Mol. Mass.:41392.76
Organism:Homo sapiens (Human)
Description:P28482
Residue:360
BDBM35641
NameBDBM35641
Synonyms:erk000040 | pyrimidylpyrrole, 2
TypeSmall organic molecule
Emp. Form.C24H23N5O2
Mol. Mass.413.4717
SMILESCc1cnc(Nc2ccccc2)nc1-c1c[nH]c(c1)C(=O)N[C@H](CO)c1ccccc1