Reaction Details
TargetMitogen-activated protein kinase 1
LigandBDBM92067
Substrate/Competitorn/a
Meas. Tech.Photometric_Method2
Ki 2±n/a nM
Citation D3R, DD Vertex ERK2 D3R D3R Publication Date 6/30/2015
 
Mitogen-activated protein kinase 1
Name:Mitogen-activated protein kinase 1
Type:Ser/Thr Protein Kinase
Mol. Mass.:41392.76
Organism:Homo sapiens (Human)
Description:P28482
Residue:360
BDBM92067
NameBDBM92067
Synonyms:erk000492
Typen/a
Emp. Form.C22H22F3N5O2
Mol. Mass.445.4376
SMILESCc1cnc(NC2CC2)nc1-c1c[nH]c(c1)C(=O)N[C@H](CO)c1cccc(c1)C(F)(F)F