Reaction Details
TargetMitogen-activated protein kinase 1
LigandBDBM92123
Substrate/Competitorn/a
Meas. Tech.Photometric_Method2
Ki 3±n/a nM
Citation D3R, DD Vertex ERK2 D3R D3R Publication Date 6/30/2015
 
Mitogen-activated protein kinase 1
Name:Mitogen-activated protein kinase 1
Type:Ser/Thr Protein Kinase
Mol. Mass.:41392.76
Organism:Homo sapiens (Human)
Description:P28482
Residue:360
BDBM92123
NameBDBM92123
Synonyms:erk000559
Typen/a
Emp. Form.C24H21Cl2N5O2
Mol. Mass.482.362
SMILESCc1cnc(Nc2cc(Cl)cc(Cl)c2)nc1-c1c[nH]c(c1)C(=O)N[C@H](CO)c1ccccc1