Reaction Details
TargetMitogen-activated protein kinase 1
LigandBDBM92210
Substrate/Competitorn/a
Meas. Tech.Photometric_Method2
Ki 2±n/a nM
Citation D3R, DD Vertex ERK2 D3R D3R Publication Date 6/30/2015
 
Mitogen-activated protein kinase 1
Name:Mitogen-activated protein kinase 1
Type:Ser/Thr Protein Kinase
Mol. Mass.:41392.76
Organism:Homo sapiens (Human)
Description:P28482
Residue:360
BDBM92210
NameBDBM92210
Synonyms:erk000671
Typen/a
Emp. Form.C22H19ClN6O2
Mol. Mass.434.878
SMILESOC[C@@H](NC(=O)c1cc(c[nH]1)-c1ncnc(Nc2ccccc2)n1)c1cccc(Cl)c1