Reaction Details
TargetTyrosine-protein kinase SYK [355-635]
LigandBDBM225517
Substrate/Competitorn/a
Meas. Tech.SYK assay_HTRF
IC50 0.412±n/a nM
Citation D3R, DD GSK SYK Kinase D3R D3R Publication Date 6/30/2015
 
Tyrosine-protein kinase SYK [355-635]
Name:Tyrosine-protein kinase SYK [355-635]
Type:n/a
Mol. Mass.:32610.83
Organism:Homo sapiens (Human)
Description:P43405[355-635]
Residue:281
BDBM225517
NameBDBM225517
Synonyms:GTC000226A | GTC000226B
TypeSmall Organic Molecule
Emp. Form.C21H21N7O3S
Mol. Mass.451.502
SMILESOCCCN(c1ccnc(Nc2ccc3CNS(=O)(=O)c3c2)n1)c1cccc2[nH]ncc12