Reaction Details
TargetTyrosine-protein kinase SYK [355-635]
LigandBDBM225520
Substrate/Competitorn/a
Meas. Tech.SYK assay_HTRF
IC50 1.1±n/a nM
Citation D3R, DD GSK SYK Kinase D3R D3R Publication Date 6/30/2015
 
Tyrosine-protein kinase SYK [355-635]
Name:Tyrosine-protein kinase SYK [355-635]
Type:n/a
Mol. Mass.:32610.83
Organism:Homo sapiens (Human)
Description:P43405[355-635]
Residue:281
BDBM225520
NameBDBM225520
Synonyms:GTC000228A GTC000228C
TypeSmall Organic Molecule
Emp. Form.C22H22FN7O3S
Mol. Mass.483.519
SMILESCOCCCN(c1cccc2[nH]ncc12)c1nc(Nc2ccc3CNS(=O)(=O)c3c2)ncc1F