Reaction Details
TargetTyrosine-protein kinase SYK [355-635]
LigandBDBM225530
Substrate/Competitorn/a
Meas. Tech.SYK assay_HTRF
IC50 1.48±n/a nM
Citation D3R, DD GSK SYK Kinase D3R D3R Publication Date 6/30/2015
 
Tyrosine-protein kinase SYK [355-635]
Name:Tyrosine-protein kinase SYK [355-635]
Type:n/a
Mol. Mass.:32610.83
Organism:Homo sapiens (Human)
Description:P43405[355-635]
Residue:281
BDBM225530
NameBDBM225530
Synonyms:GTC000236A
TypeSmall Organic Molecule
Emp. Form.C22H23N7O3S
Mol. Mass.465.528
SMILESCOCCCN(c1ccnc(Nc2ccc3CNS(=O)(=O)c3c2)n1)c1cccc2[nH]ncc12