Reaction Details
TargetHeat shock protein HSP 90-beta
LigandBDBM225744
Substrate/Competitorn/a
Meas. Tech.Thermofluor Assay
Kd 165±16.5 nM
Citation D3R, DD AbbVie-CSAR HSP90 D3R D3R Publication Date 9/2/2016
 
Heat shock protein HSP 90-beta
Name:Heat shock protein HSP 90-beta
Type:Molecular Chaperone
Mol. Mass.:83229.45
Organism:Homo sapiens (Human)
Description:P08238
Residue:724
BDBM225744
NameBDBM225744
Synonyms:hsp90_40
TypeSmall Organic Molecule
Emp. Form.C15H14N2O3
Mol. Mass.270.2833
SMILESCCc1cc(c(O)cc1O)-n1c2ccccc2[nH]c1=O