Reaction Details
TargetMitogen-activated protein kinase kinase kinase kinase 4
LigandBDBM225886
Substrate/Competitorn/a
Meas. Tech.Z'Lyte Assay
IC50 1000±n/a nM
Citation D3R, DD Genentech MAP4K4 D3R D3R Publication Date 9/2/2016
 
Mitogen-activated protein kinase kinase kinase kinase 4
Name:Mitogen-activated protein kinase kinase kinase kinase 4
Type:Serine/threonine-protein kinase
Mol. Mass.:142114.73
Organism:Homo sapiens (Human)
Description:O95819
Residue:1239
BDBM225886
NameBDBM225886
Synonyms:MAP04
TypeSmall Organic Molecule
Emp. Form.C10H9N3S
Mol. Mass.203.264
SMILESCc1cc(C)c2c(N)c(sc2n1)C#N