Reaction Details
TargetMitogen-activated protein kinase kinase kinase kinase 4
LigandBDBM225888
Substrate/Competitorn/a
Meas. Tech.Z'Lyte Assay
Ki 109±n/a nM
IC50 76.8±n/a nM
Citation D3R, DD Genentech MAP4K4 D3R D3R Publication Date 9/2/2016
 
Mitogen-activated protein kinase kinase kinase kinase 4
Name:Mitogen-activated protein kinase kinase kinase kinase 4
Type:Serine/threonine-protein kinase
Mol. Mass.:142114.73
Organism:Homo sapiens (Human)
Description:O95819
Residue:1239
BDBM225888
NameBDBM225888
Synonyms:MAP06
TypeSmall Organic Molecule
Emp. Form.C16H15ClN2O2
Mol. Mass.302.756
SMILESCC(=O)NCC1Cc2cc(Cl)cc(c2O1)-c1ccncc1