Reaction Details
TargetMitogen-activated protein kinase kinase kinase kinase 4
LigandBDBM225890
Substrate/Competitorn/a
Meas. Tech.Z'Lyte Assay
Ki 95.4±n/a nM
IC50 101±n/a nM
Citation D3R, DD Genentech MAP4K4 D3R D3R Publication Date 9/2/2016
 
Mitogen-activated protein kinase kinase kinase kinase 4
Name:Mitogen-activated protein kinase kinase kinase kinase 4
Type:Serine/threonine-protein kinase
Mol. Mass.:142114.73
Organism:Homo sapiens (Human)
Description:O95819
Residue:1239
BDBM225890
NameBDBM225890
Synonyms:MAP08
TypeSmall Organic Molecule
Emp. Form.C18H16ClN3O
Mol. Mass.325.792
SMILESCn1c(cc2cnc(NC(=O)C3CC3)cc12)-c1ccccc1Cl