Reaction Details
TargetBile acid receptor
LigandBDBM225913
Substrate/Competitorn/a
Meas. Tech.Scintillation Proximity Assay (SPA)
pH7.4±n/a
IC50 56100±n/a nM
Commentsextracted
Citation D3R, DD Drug Design Data Resource Grand Challenge 2 Dataset: FXR - Farnesoid X Receptor D3R D3R Publication Date 4/13/2017
 
Bile acid receptor
Name:Bile acid receptor
Type:Nuclear Receptor
Mol. Mass.:55916.24
Organism:Homo sapiens (Human)
Description:Q96RI1
Residue:486
BDBM225913
NameBDBM225913
Synonyms:FXR_1
TypeSmall Organic Molecule
Emp. Form.C24H34N2O5S
Mol. Mass.462.602
SMILESCOc1ccc(cc1OC)N(CC(=O)NC(C(C)C)C(C)C)S(=O)(=O)c1ccc(C)cc1