Reaction Details
TargetBile acid receptor
LigandBDBM225914
Substrate/Competitorn/a
Meas. Tech.Scintillation Proximity Assay (SPA)
pH7.4±n/a
IC50 4640±n/a nM
Commentsextracted
Citation D3R, DD Drug Design Data Resource Grand Challenge 2 Dataset: FXR - Farnesoid X Receptor D3R D3R Publication Date 4/13/2017
 
Bile acid receptor
Name:Bile acid receptor
Type:Nuclear Receptor
Mol. Mass.:55916.24
Organism:Homo sapiens (Human)
Description:Q96RI1
Residue:486
BDBM225914
NameBDBM225914
Synonyms:FXR_2
TypeSmall Organic Molecule
Emp. Form.C22H19F2N3
Mol. Mass.363.4032
SMILESCc1cccc(C)c1Nc1c(nc2cccc(C)n12)-c1c(F)cccc1F