Reaction Details
TargetBile acid receptor
LigandBDBM28538
Substrate/Competitorn/a
Meas. Tech.Scintillation Proximity Assay (SPA)
pH7.4±n/a
IC50 1420±n/a nM
Commentsextracted
Citation D3R, DD Drug Design Data Resource Grand Challenge 2 Dataset: FXR - Farnesoid X Receptor D3R D3R Publication Date 4/13/2017
 
Bile acid receptor
Name:Bile acid receptor
Type:Nuclear Receptor
Mol. Mass.:55916.24
Organism:Homo sapiens (Human)
Description:Q96RI1
Residue:486
BDBM28538
NameBDBM28538
Synonyms:Azepino[4,5-b]indole, 6i ethyl 3-[(3,4-difluorophenyl)carbonyl]-1,1-dimethyl-1H,2H,3H,6H-azepino[4,5-b]indole-5-carboxylate
TypeSmall organic molecule
Emp. Form.C24H22F2N2O3
Mol. Mass.424.4399
SMILESCCOC(=O)C1=CN(CC(C)(C)c2c1[nH]c1ccccc21)C(=O)c1ccc(F)c(F)c1