Reaction Details
TargetBile acid receptor
LigandBDBM225917
Substrate/Competitorn/a
Meas. Tech.Scintillation Proximity Assay (SPA)
pH7.4±n/a
IC50 59.600000±n/a nM
Commentsextracted
Citation D3R, DD Drug Design Data Resource Grand Challenge 2 Dataset: FXR - Farnesoid X Receptor D3R D3R Publication Date 4/13/2017
 
Bile acid receptor
Name:Bile acid receptor
Type:Nuclear Receptor
Mol. Mass.:55916.24
Organism:Homo sapiens (Human)
Description:Q96RI1
Residue:486
BDBM225917
NameBDBM225917
Synonyms:FXR_6
TypeSmall Organic Molecule
Emp. Form.C29H37N3O3
Mol. Mass.475.6224
SMILESCOc1ccc(-c2nc3ccccc3n2[C@@H](C2CCCCC2)C(=O)NC2CCCCC2)c(OC)c1