Reaction Details
TargetBile acid receptor
LigandBDBM225930
Substrate/Competitorn/a
Meas. Tech.Scintillation Proximity Assay (SPA)
pH7.4±n/a
IC50 91±n/a nM
Commentsextracted
Citation D3R, DD Drug Design Data Resource Grand Challenge 2 Dataset: FXR - Farnesoid X Receptor D3R D3R Publication Date 4/13/2017
 
Bile acid receptor
Name:Bile acid receptor
Type:Nuclear Receptor
Mol. Mass.:55916.24
Organism:Homo sapiens (Human)
Description:Q96RI1
Residue:486
BDBM225930
NameBDBM225930
Synonyms:FXR_19
TypeSmall Organic Molecule
Emp. Form.C26H28Cl2FN3O2
Mol. Mass.504.424
SMILESFc1cc2nc(-c3ccc(Cl)cc3)n([C@@H]([C@@H]3CCCCO3)C(=O)NC3CCCCC3)c2cc1Cl